{"text_format":"1","workbook":"xlsx","n_sheets":11,"sheets":["Transmission","Lüftung_Gewinne","Warmwasser","Lüftungsanlage","Heizung","Primärenergie","Ergebnis","Info","Hilfe","rech","ref"],"not_rendered":{"charts":1,"images":27,"macros":1,"external_links":0,"defined_names":1,"comments":0,"pivot_tables":0},"unopened":[],"bounds":{"document_bytes":16777216,"sheet_cells":100000,"rows_first":2000,"rows_last":500,"rows_between":2000,"halvings":0,"cell_chars":16384,"cell_head_chars":4096},"cells_cut":0,"cells_raw":0,"read":"whole","date_system":"1900"}

{"sheet":"Transmission","index":0,"n_rows":51,"n_cols":18,"rows_kept":51,"cut":false,"hidden":false,"merged":[[20,10,21,10]]}
["Transmissionswärmeverlust"]
[]
["Gebäudevolumen",501.91,"m³",null,"Gebäudenutzfläche",null,{"$f":"B3*0.32","v":160.61120000000003},"m²"]
[]
["Gebäudetyp"]
[]
[]
[null,"Fläche",null,"U-Wert",null,"Gewichtung","Verluste"]
["Aussenwand",158.87,"m²",0.21,"W/(m²∙K)",1,{"$f":"rech!I5","v":3623.1815942399994},"kWh",null,null,null,null,null,null,null,null,null,{"$f":"B9*D9*F9","v":33.362699999999997}]
["Haustür",3.8,"m²",1.3,"W/(m²∙K)",1,{"$f":"rech!I6","v":449.97897599999999},"kWh",null,null,null,null,null,null,null,null,null,{"$f":"B10*D10*F10","v":4.9399999999999995}]
["Kellerdecke/Sohle",87.24,"m²",0.23,"W/(m²∙K)",0.6,{"$f":"rech!I7","v":1174.6240663680001},"kWh",null,null,"Bestimmung Höchstwerte",null,null,null,null,null,null,12.03912]
["Dach",50,"m²",0.17,"W/(m²∙K)",1,{"$f":"rech!I8","v":964.86720000000003},"kWh",null,null,"für H'T und H'T,ref",null,null,null,null,null,null,8.5]
["OG-Decke",63.91,"m²",0.17,"W/(m²∙K)",0.8,{"$f":"rech!I9","v":1042.6933883519998},"kWh",null,null,null,null,null,null,null,null,null,8.6917600000000004]
["Bodenluke",0.72,"m²",0.7,"W/(m²∙K)",0.8,{"$f":"rech!I10","v":38.524515839999992},"kWh",null,null,null,null,null,null,null,null,null,0.4032]
["Fenster nord",5.47,"m²",1.3,"W/(m²∙K)",1,{"$f":"rech!I11","v":647.73289439999996},"kWh",null,null,"∙",null,null,null,null,null,null,7.1109999999999998]
{"$rows_left_out":37}
{"sheet":"Lüftung_Gewinne","index":1,"n_rows":47,"n_cols":11,"rows_kept":47,"cut":false,"hidden":false,"merged":[]}
["Lüftungswärmeverlust"]
[]
["Art des Dichtheitsnachweises"]
[]
[]
["Lüftungswärmeverlust Heizperiode",null,null,null,null,null,null,{"$f":"rech!I27","v":7963.2666054681604},"kWh"]
[]
[]
["Solare und interne Gewinne"]
[null,null,null,null,null,null,null,null,null,null,"Transmissionswärmeverluste"]
["wirks. Wärmespeicherfähigkeit",null,null,"g-Wert",null,"Fläche",null,null,null,null,{"$f":"Transmission!G27","v":10925.6737392}]
[null,null,"nord   ",{"$f":"A33/100","v":0.57999999999999996},null,{"$f":"Transmission!B15","v":5.47},"m²",{"$f":"rech!I41","v":782.11737233279973},"kWh",null,"+"]
[null,null,"ost   ",{"$f":"A34/100","v":0.57999999999999996},null,{"$f":"Transmission!B16","v":4.88},"m²",{"$f":"rech!I42","v":1145.9305073663995},"kWh",null,"Lüftungswärmeverluste"]
["  m. NA = mit Nachtabsenkung",null,"west   ",{"$f":"A35/100","v":0.57999999999999996},null,{"$f":"Transmission!B17","v":7.44},"m²",{"$f":"rech!I44","v":1747.0743800831997},"kWh",null,{"$f":"H6","v":7963.2666054681604}]
["  o. NA = ohne Nachtabsenkung",null,"süd   ",{"$f":"A36/100","v":0.57999999999999996},null,{"$f":"Transmission!B18","v":12.88},"m²",{"$f":"rech!I43","v":3444.5526732288004},"kWh",null,"-"]
{"$rows_left_out":33}
{"sheet":"Warmwasser","index":2,"n_rows":410,"n_cols":73,"rows_kept":410,"cut":false,"hidden":false,"merged":[[63,9,63,11],[60,17,60,18],[61,17,61,18],[62,7,62,8],[62,17,62,18],[60,5,60,6],[61,5,61,6],[62,5,62,6],[3,10,4,12],[63,17,63,18],[59,12,59,14],[60,12,60,14],[61,12,61,14],[62,12,62,14],[63,12,63,14],[57,15,57,18],[58,17,58,18],[59,17,59,18],[48,15,48,18],[49,17,49,18],[50,17,50,18],[51,17,51,18],[52,17,52,18],[53,17,53,18],[51,9,51,11],[52,9,52,11],[62,3,62,4],[58,12,58,14],[59,7,59,8],[60,7,60,8],[61,7,61,8],[54,17,54,18],[62,9,62,11],[53,9,53,11],[54,9,54,11],[54,7,54,8],[58,3,58,4],[59,3,59,4],[60,3,60,4],[61,3,61,4],[57,2,57,6],[57,7,57,14],[58,7,58,8],[58,9,58,11],[59,9,59,11],[60,9,60,11],[61,9,61,11],[49,5,49,6],[50,5,50,6],[51,5,51,6],[52,5,52,6],[53,5,53,6],[54,5,54,6],[63,5,63,6],[48,7,48,14],[48,2,48,6],[49,7,49,8],[50,7,50,8],[51,7,51,8],[52,7,52,8],[49,3,49,4],[50,3,50,4],[53,7,53,8],[49,12,49,14],[50,12,50,14],[51,12,51,14],[52,12,52,14],[53,12,53,14],[54,12,54,14],[49,9,49,11],[50,9,50,11],[63,7,63,8],[67,3,67,4],[68,3,68,4],[69,3,69,4],[70,3,70,4],[71,3,71,4],[72,3,72,4],[51,3,51,4],[52,3,52,4],[53,3,53,4],[54,3,54,4],[63,3,63,4],[58,5,58,6],[59,5,59,6],[66,9,66,11],[67,9,67,11],[68,9,68,11],[69,9,69,11],[70,9,70,11],[71,9,71,11],[72,5,72,6],[66,7,66,8],[67,7,67,8],[68,7,68,8],[69,7,69,8],[70,7,70,8],[71,7,71,8],[72,7,72,8],[66,5,66,6],[67,5,67,6],[68,5,68,6],[69,5,69,6],[70,5,70,6],[71,5,71,6],[67,18,67,19],[68,18,68,19],[69,18,69,19],[70,18,70,19],[71,18,71,19],[72,18,72,19],[72,9,72,11],[67,12,67,14],[68,12,68,14],[69,12,69,14],[70,12,70,14],[71,12,71,14],[72,12,72,14]]}
["Ermittlung der Anlagenaufwand nach DIN V 4701-10"]
[]
["Trinkwassererwärmung",null,null,"Verteilung im unbeheizten Bereich"]
[null,null,null,null,null,null,null,null,null,null,"gemeinsame Installationswand"]
["Trinkwasserwärmebedarf",null,null,null,"12,5 ∙ AN",null,{"$f":"Transmission!G3*12.5","v":2007.6400000000003},"kWh/a"]
[]
[]
["Aufwand",null,null,null,"Brennstoff",null,null,null,null,null,null,"Hilfsenergie"]
[null,null,null,null,"spezifisch",null,"absolut",null,"Gewinn"]
["Übergabe",null,null,null,0,"kWh/m²",{"$f":"E10*Transmission!G3+G5","v":2007.6400000000003},"kWh",null,null,null,0,"kWh/m²"]
[]
["Verteilung",null,null,null,11.281663999999999,"kWh/m²",{"$f":"E12*Transmission!G3+G10","v":3819.6015930368003},"kWh",1.7,"kWh/m²",null,0.78604415999999988,"kWh/m²"]
[]
["Speicherung",null,null,null,4.587775999999999,"kWh/m²",4556.4498017280002,"kWh",null,null,null,7.7877760000000004E-2,"kWh/m²"]
[]
{"$rows_left_out":396}
{"sheet":"Lüftungsanlage","index":3,"n_rows":42,"n_cols":13,"rows_kept":42,"cut":false,"hidden":false,"merged":[]}
["Ermittlung der Aufwandszahl nach DIN V 4701-10"]
[]
["Lüftungsanlage",null,null,null,"Anlage ohne Nachheizung"]
[null,null,null,null,"Verteilung im unbeheizten Dach"]
[null,null,null,null,"Anlagenluftwechsel 0,4"]
[]
[]
["Aufwand",null,null,null,"Brennstoff",null,null,null,null,null,null,"Hilfsenergie"]
[null,null,null,null,"spezifisch",null,"absolut",null,"Gewinn"]
["Übergabe",null,null,null,0,"kWh/m²",0,"kWh",null,null,null,0,"kWh/m²"]
[]
["Verteilung",null,null,null,0,"kWh/m²",{"$f":"E12*Transmission!G3+G10","v":0},"kWh",null,null,null,0,"kWh/m²"]
[]
["Erzeugung",null,null,null,{"$f":"IF(G39=0,E39,IF(G39=1,E40,IF(G39=2,E41,IF(G39=3,E42))))","v":0},"kWh/m²",{"$f":"E14*Transmission!G3+G12","v":0},"kWh",{"$f":"IF(G39=0,IF(Lüftung_Gewinne!F40=0,0,F39),IF(G39=1,IF(Lüftung_Gewinne!F40=0,0,F40),IF(G39=2,F41,IF(G39=3,F42))))","v":0},"kWh/m²",null,{"$f":"IF(G39=0,I39,IF(G39=1,I40,IF(G39=2,I41,IF(G39=3,I42))))","v":0},"kWh/m²"]
[]
{"$rows_left_out":28}
{"sheet":"Heizung","index":4,"n_rows":45,"n_cols":13,"rows_kept":45,"cut":false,"hidden":false,"merged":[]}
["Ermittlung der Aufwandszahl nach DIN V 4701-10"]
[]
["Heizung",null,null,null,"horizontale Verteilung außerhalb der thermischen Hülle"]
[null,null,null,null,"Verteilungsstränge außenliegend und geregelte Pumpen"]
["Heizwärmebedarf",null,null,null,null,null,{"$f":"Lüftung_Gewinne!H24","v":8876.4361864325638},"kWh/a"]
[]
["abzgl. Gewinne (aus WW + Lüftung)",null,null,null,{"$f":"Warmwasser!G25+Lüftungsanlage!G25","v":273.03904000000006},"kWh/a",{"$f":"G5-E7","v":8603.3971464325641},"kWh/a"]
[]
[]
["Aufwand",null,null,null,"Brennstoff",null,null,null,null,null,null,"Hilfsenergie"]
[null,null,null,null,"spezifisch",null,"absolut"]
["Übergabe",null,null,null,3.3,"kWh/m²",{"$f":"E12*Transmission!G3+G7","v":9133.4141064325649},"kWh",null,null,null,0,"kWh/m²"]
[]
["Verteilung",null,null,null,6.2665535999999999,"kWh/m²",{"$f":"E14*Transmission!G3+G12","v":10139.892799992886},"kWh",null,null,null,1.2884550399999999,"kWh/m²"]
[]
{"$rows_left_out":31}
{"sheet":"Primärenergie","index":5,"n_rows":52,"n_cols":11,"rows_kept":52,"cut":false,"hidden":false,"merged":[[39,8,39,9],[40,8,40,9],[41,8,41,9]]}
["Primärenergiebedarf"]
[]
[]
["Primärenergiebedarf Wärme"]
[null,"Endenergiebedarf",null,null,"Primärenergie-Faktor",null,"PE-Bedarf"]
["Heizung",{"$f":"Heizung!G21","v":11436.559577896101},"kWh",null,null,null,12580.215535685713,"kWh"]
["Warmwasser",{"$f":"Warmwasser!G21","v":5412.5053840291002},"kWh",null,null,null,5953.7559224320112,"kWh"]
["Lüftungsanlage",{"$f":"Lüftungsanlage!G21","v":0},"kWh",null,null,null,0,"kWh"]
[]
["Primärenergiebedarf Hilfsenergie"]
[null,"Endenergiebedarf",null,null,"Primärenergie-Faktor",null,"PE-Bedarf"]
["Heizung",{"$f":"Heizung!G23","v":310.21685801574404},"kWh",null,null,null,806.56383084093454,"kWh"]
["Warmwasser",{"$f":"Warmwasser!G23","v":176.27965773824002},"kWh",null,null,null,458.32711011942405,"kWh"]
["Lüftungsanlage",{"$f":"Lüftungsanlage!G23","v":0},"kWh",null,null,null,0,"kWh"]
[]
{"$rows_left_out":38}
{"sheet":"Ergebnis","index":6,"n_rows":47,"n_cols":8,"rows_kept":47,"cut":false,"hidden":false,"merged":[]}
["Ergebnis nach EnEV 2009/2013/2016"]
[]
[]
[]
[null,null,null,null,null,"Spez. Transmissionsverlust H'T"]
[]
[null,null,null,null,null,"zulässig",{"$f":"Transmission!K25","v":0.4},"W/(m²∙K)"]
[null,null,null,null,null,"erreicht",{"$f":"Transmission!K29","v":0.32278606310569058},"W/(m²∙K)"]
[]
[]
[null,null,null,null,null,"Spez. Transmissionsverlust H'T,ref"]
[]
[null,null,null,null,null,"zulässig",{"$f":"Transmission!K23","v":0.36698514713696512},"W/(m²∙K)"]
[null,null,null,null,null,"erreicht",{"$f":"Transmission!K29","v":0.32278606310569058},"W/(m²∙K)"]
[]
{"$rows_left_out":33}
{"sheet":"Info","index":7,"n_rows":30,"n_cols":4,"rows_kept":30,"cut":false,"hidden":false,"merged":[]}
[]
[]
[]
[null,"EXCEL-Arbeitsmappe zur Energieeinsparverordnung 2013/2016"]
[null,"(nach dem Stand der Energieeinsparverordnung vom 18.11.2013 - Bundesgesetzblatt)"]
[]
[]
[]
[]
[null,null,null,"Ingenieurbüro für Energieberatung"]
[null,null,null,"Ernst Merkschien"]
[null,null,null,"33604 Bielefeld"]
[null,null,null,"Tel.: 0521/5575275"]
[null,null,null,"Fax: 0521/5575279"]
[null,null,null,"Mail: info@merkschien.de"]
{"$rows_left_out":16}
{"sheet":"Hilfe","index":8,"n_rows":29,"n_cols":2,"rows_kept":29,"cut":false,"hidden":false,"merged":[]}
[]
[null,"EXCEL-Berechnungstool Nachweis Neubau (EnEV.XLS)"]
[null,"Kurzbeschreibung zur Arbeitsmappe"]
[]
[null,"Bei der Arbeitsmappe EnEV.XLS handelt es sich um ein didaktisches Instrument, mit dessen Hilfe die Rechengänge der Energieeinsparverordnung im Rahmen eines Seminars den Teilnehmern vermittelt werden sollen. Es ist auch dazu geeignet, sich im Rahmen des Selbststudiums ein Gefühl für die Verordnung zu erarbeiten."]
[]
[null,"Die Arbeitsmappe wurde auf dem Betriebssystem Windows mit Excel ´97 erstellt und an die folgenden Excel-Versionen bis inkl. Version 2013 angepasst, so dass sie auf allen heute verwendeten Excel-Versionen lauffähig sein müsste. Mit dem Programm OpenOffice ist das Arbeitsblatt nicht zu betreiben."]
[]
[null,"Nach dem Start der Datei gibt Excel einen Hinweis darauf, dass die Arbeitsmappe Makros enthält. Hier muss die Schaltfläche „Makros aktivieren“ gedrückt werden, da das Rechenblatt sonst nicht komplett funktioniert. In neueren Excel-Versionen erscheint unterhalb der Menuleiste der folgende Hinweis:"]
[]
[null,"„Sicherheitswarnung: Die automatische Aktualisierung von Hyperlinks wurde deaktiviert“"]
[]
[null,"Dahinter befindet sich ein Knopf mit der Beschriftung „Qptionen“. Dieser muss betätigt werden und in der folgenden Auswahl ist der Punkt „Diesen Inhalt aktivieren“ zu markieren. Die Auswahl ist mit „OK“ zu bestätigen."]
[]
[null,"Nach dem Öffnen des Arbeitsblattes gelangt man auf die Info-Seite.  Hier werden Informationen zum Ersteller und Copyright gegeben."]
{"$rows_left_out":15}
{"sheet":"rech","index":9,"n_rows":199,"n_cols":23,"rows_kept":199,"cut":false,"hidden":true,"merged":[[181,10,181,14],[172,12,172,14],[175,10,175,14],[176,10,176,14],[178,10,178,14],[180,10,180,14],[164,10,164,11],[164,12,164,14],[165,10,165,11],[165,12,165,14],[166,10,171,11],[166,12,166,14],[167,12,167,14],[168,12,168,14],[169,12,169,14],[170,12,170,14],[171,12,171,14],[161,10,161,11],[161,12,161,14],[162,10,162,11],[162,12,162,14],[163,10,163,11],[163,12,163,14],[158,10,158,11],[158,12,158,14],[159,10,159,11],[159,12,159,14],[160,10,160,11],[160,12,160,14],[155,10,155,11],[155,12,155,14],[156,10,156,11],[156,12,156,14],[157,10,157,11],[157,12,157,14],[152,10,152,11],[152,12,152,14],[153,10,153,11],[153,12,153,14],[154,10,154,11],[154,12,154,14],[146,10,146,14],[147,10,147,14],[149,10,149,14],[150,10,150,14],[151,10,151,16],[141,10,141,14],[142,10,142,14],[143,10,143,14],[144,10,144,14],[145,10,145,14],[191,4,191,5],[192,4,192,5],[193,4,193,5],[185,4,185,5],[186,4,186,5],[187,4,187,5],[188,4,188,5],[189,4,189,5],[190,4,190,5]]}
["Transmissionswärmeverluste"]
[]
[null,null,"Fläche","U-Wert","g-Wert","Fx","HWB","HT","Q in kWh",null,null,"J","F","M","A","M","J","J","A","S","O","N","D"]
[]
[null,{"$f":"Transmission!A9","v":"Aussenwand"},{"$f":"Transmission!B9","v":158.87},{"$f":"Transmission!D9","v":0.21},"-",{"$f":"Transmission!F9","v":1},{"$f":"$C$20*C5","v":7.9435000000000002},{"$f":"C5*D5*F5+G5","v":41.306199999999997},{"$f":"SUM(L5:W5)","v":3623.1815942399994},null,null,{"$f":"(C5*D5*F5+G5)*0.024*(L$20-L$21)*L$22","v":623.85579983999992},{"$f":"(C5*D5*F5+G5)*0.024*(M$20-M$21)*M$22","v":510.74290175999994},{"$f":"(C5*D5*F5+G5)*0.024*(N$20-N$21)*N$22","v":457.90401071999997},{"$f":"(C5*D5*F5+G5)*0.024*(O$20-O$21)*O$22","v":282.53440799999998},{"$f":"(C5*D5*F5+G5)*0.024*(P$20-P$21)*P$22","v":187.46405807999997},{"$f":"(C5*D5*F5+G5)*0.024*(Q$20-Q$21)*Q$22","v":98.143531200000012},{"$f":"(C5*D5*F5+G5)*0.024*(R$20-R$21)*R$22","v":30.731812799999997},{"$f":"(C5*D5*F5+G5)*0.024*(S$20-S$21)*S$22","v":21.512268959999975},{"$f":"(C5*D5*F5+G5)*0.024*(T$20-T$21)*T$22","v":136.80613439999999},{"$f":"(C5*D5*F5+G5)*0.024*(U$20-U$21)*U$22","v":304.24494671999997},{"$f":"(C5*D5*F5+G5)*0.024*(V$20-V$21)*V$22","v":425.28863519999999},{"$f":"(C5*D5*F5+G5)*0.024*(W$20-W$21)*W$22","v":543.95308655999986}]
[null,{"$f":"Transmission!A10","v":"Haustür"},{"$f":"Transmission!B10","v":3.8},{"$f":"Transmission!D10","v":1.3},"-",{"$f":"Transmission!F10","v":1},{"$f":"$C$20*C6","v":0.19},{"$f":"C6*D6*F6+G6","v":5.13},{"$f":"SUM(L6:W6)","v":449.97897599999999},null,null,77.479416000000001,{"$f":"(C6*D6*F6+G6)*0.024*(M$20-M$21)*M$22","v":63.431423999999993},{"$f":"(C6*D6*F6+G6)*0.024*(N$20-N$21)*N$22","v":56.869127999999996},{"$f":"(C6*D6*F6+G6)*0.024*(O$20-O$21)*O$22","v":35.089199999999998},{"$f":"(C6*D6*F6+G6)*0.024*(P$20-P$21)*P$22","v":23.281991999999999},{"$f":"(C6*D6*F6+G6)*0.024*(Q$20-Q$21)*Q$22","v":12.188880000000001},{"$f":"(C6*D6*F6+G6)*0.024*(R$20-R$21)*R$22","v":3.8167199999999997},{"$f":"(C6*D6*F6+G6)*0.024*(S$20-S$21)*S$22","v":2.6717039999999974},{"$f":"(C6*D6*F6+G6)*0.024*(T$20-T$21)*T$22","v":16.990559999999999},{"$f":"(C6*D6*F6+G6)*0.024*(U$20-U$21)*U$22","v":37.785527999999999},{"$f":"(C6*D6*F6+G6)*0.024*(V$20-V$21)*V$22","v":52.818480000000001},{"$f":"(C6*D6*F6+G6)*0.024*(W$20-W$21)*W$22","v":67.555943999999982}]
[null,{"$f":"Transmission!A11","v":"Kellerdecke/Sohle"},{"$f":"Transmission!B11","v":87.24},{"$f":"Transmission!D11","v":0.23},"-",0.45,{"$f":"$C$20*C7","v":4.3620000000000001},13.391340000000001,1174.6240663680001,null,null,202.25208628800002,165.58124083200002,148.45103870400001,91.596765600000012,60.775257455999999,31.817823840000013,9.963156960000001,6.9742098719999932,44.352118080000004,98.63525390400001,137.87723664000004,176.347878192]
[null,{"$f":"Transmission!A12","v":"Dach"},{"$f":"Transmission!B12","v":50},{"$f":"Transmission!D12","v":0.17},"-",{"$f":"Transmission!F12","v":1},2.5,11,964.86720000000003,null,null,166.13520000000003,136.0128,121.94160000000001,75.239999999999995,49.922400000000003,26.136000000000006,8.1840000000000011,5.7287999999999943,36.431999999999995,81.021600000000007,113.25600000000001,144.85679999999999]
[null,{"$f":"Transmission!A13","v":"OG-Decke"},{"$f":"Transmission!B13","v":63.91},{"$f":"Transmission!D13","v":0.17},"-",{"$f":"Transmission!F13","v":0.8},3.1955,11.887260000000001,1042.6933883519998,null,null,179.53566523200001,146.983592448,131.77740945600002,81.30885840000002,53.949140784000001,28.244129760000007,8.8441214400000003,6.1908850079999942,39.37060512,87.556802256000012,122.39122896000002,156.540949488]
[null,{"$f":"Transmission!A14","v":"Bodenluke"},{"$f":"Transmission!B14","v":0.72},{"$f":"Transmission!D14","v":0.7},"-",{"$f":"Transmission!F14","v":0.8},3.5999999999999997E-2,0.43919999999999998,38.524515839999992,null,null,6.6333254399999992,5.4306201599999993,4.8687955199999999,3.0041279999999997,1.9932652799999997,1.0435392000000001,0.32676479999999997,0.22873535999999978,1.4546303999999997,3.2349715200000002,4.5220032000000003,5.7837369599999997]
[{"$f":"$C$5*C11/$C$15","v":28.334492989892404},{"$f":"Transmission!A15","v":"Fenster nord"},{"$f":"Transmission!B15","v":5.47},{"$f":"Transmission!D15","v":1.3},{"$f":"Lüftung_Gewinne!D12","v":0.57999999999999996},{"$f":"Transmission!F15","v":1},0.27350000000000002,7.3845000000000001,647.73289439999996,null,null,111.52958040000001,91.307865599999985,81.861613199999994,50.509979999999999,33.513814799999999,17.545572000000003,5.4940679999999995,3.8458475999999959,24.457463999999998,54.391273200000001,76.030812000000012,97.24500359999999]
[{"$f":"$C$5*C12/$C$15","v":25.278304532116074},{"$f":"Transmission!A16","v":"Fenster ost"},{"$f":"Transmission!B16","v":4.88},{"$f":"Transmission!D16","v":1.3},{"$f":"Lüftung_Gewinne!D13","v":0.57999999999999996},{"$f":"Transmission!F16","v":1},0.24399999999999999,6.5880000000000001,577.86773760000005,null,null,99.499881600000009,81.459302399999999,73.031932800000007,45.061920000000001,29.898979199999999,15.653088000000006,4.9014720000000001,3.4310303999999965,21.819455999999999,48.524572800000008,67.830048000000005,86.756054399999996]
[{"$f":"$C$5*C13/$C$15","v":38.539054450603196},{"$f":"Transmission!A17","v":"Fenster west"},{"$f":"Transmission!B17","v":7.44},{"$f":"Transmission!D17","v":1.3},{"$f":"Lüftung_Gewinne!D14","v":0.57999999999999996},{"$f":"Transmission!F17","v":1},0.37200000000000005,10.044,881.01146880000022,null,null,151.69654080000004,124.19205120000001,111.34376640000001,68.700960000000009,45.5836896,23.864544000000006,7.4727360000000003,5.2309151999999948,33.265728000000003,73.980086400000005,103.41302400000001,132.26742720000001]
[{"$f":"$C$5*C14/$C$15","v":66.718148027388324},{"$f":"Transmission!A18","v":"Fenster süd"},{"$f":"Transmission!B18","v":12.88},{"$f":"Transmission!D18","v":1.3},{"$f":"Lüftung_Gewinne!D15","v":0.57999999999999996},{"$f":"Transmission!F18","v":1},0.64400000000000013,17.388000000000005,1525.1918976000006,{"$f":"SUM(I11:I14)","v":3631.8039984000011},null,262.61444160000008,214.99914240000007,192.75641280000008,118.93392000000004,78.913699200000025,41.31388800000002,12.936672000000003,9.0556703999999932,57.589056000000014,128.07305280000006,179.02684800000009,228.97909440000004]
[null,null,{"$f":"SUM(C11:C14)","v":30.67}]
{"$rows_left_out":185}
{"sheet":"ref","index":10,"n_rows":199,"n_cols":23,"rows_kept":199,"cut":false,"hidden":true,"merged":[[181,10,181,14],[171,12,171,14],[172,12,172,14],[175,10,175,14],[176,10,176,14],[178,10,178,14],[180,10,180,14],[166,10,171,11],[166,12,166,14],[167,12,167,14],[162,10,162,11],[162,12,162,14],[168,12,168,14],[169,12,169,14],[170,12,170,14],[163,10,163,11],[163,12,163,14],[164,10,164,11],[164,12,164,14],[165,10,165,11],[165,12,165,14],[186,4,186,5],[145,10,145,14],[146,10,146,14],[147,10,147,14],[149,10,149,14],[150,10,150,14],[151,10,151,16],[152,10,152,11],[152,12,152,14],[153,10,153,11],[153,12,153,14],[154,10,154,11],[154,12,154,14],[155,10,155,11],[155,12,155,14],[156,10,156,11],[141,10,141,14],[142,10,142,14],[143,10,143,14],[144,10,144,14],[185,4,185,5],[156,12,156,14],[157,10,157,11],[157,12,157,14],[158,10,158,11],[158,12,158,14],[159,10,159,11],[159,12,159,14],[160,10,160,11],[160,12,160,14],[161,10,161,11],[161,12,161,14],[193,4,193,5],[187,4,187,5],[188,4,188,5],[189,4,189,5],[190,4,190,5],[191,4,191,5],[192,4,192,5]]}
["Transmissionswärmeverluste"]
[]
[null,null,"Fläche","U-Wert","g-Wert","Fx","HWB","HT","Q in kWh",null,null,"J","F","M","A","M","J","J","A","S","O","N","D"]
[]
[null,{"$f":"Transmission!A9","v":"Aussenwand"},{"$f":"Transmission!B9","v":158.87},0.28000000000000003,"-",{"$f":"Transmission!F9","v":1},{"$f":"$C$20*C5","v":7.9435000000000002},{"$f":"C5*D5*F5+G5","v":52.427100000000003},{"$f":"SUM(L5:W5)","v":4598.6535619200004},null,null,{"$f":"(C5*D5*F5+G5)*0.024*(L$20-L$21)*L$22","v":791.81697672000007},{"$f":"(C5*D5*F5+G5)*0.024*(M$20-M$21)*M$22","v":648.25060608000001},{"$f":"(C5*D5*F5+G5)*0.024*(N$20-N$21)*N$22","v":581.18585976000008},{"$f":"(C5*D5*F5+G5)*0.024*(O$20-O$21)*O$22","v":358.60136400000005},{"$f":"(C5*D5*F5+G5)*0.024*(P$20-P$21)*P$22","v":237.93515064000002},{"$f":"(C5*D5*F5+G5)*0.024*(Q$20-Q$21)*Q$22","v":124.56678960000004},{"$f":"(C5*D5*F5+G5)*0.024*(R$20-R$21)*R$22","v":39.005762400000002},{"$f":"(C5*D5*F5+G5)*0.024*(S$20-S$21)*S$22","v":27.304033679999975},{"$f":"(C5*D5*F5+G5)*0.024*(T$20-T$21)*T$22","v":173.63855519999998},{"$f":"(C5*D5*F5+G5)*0.024*(U$20-U$21)*U$22","v":386.15704776000007},{"$f":"(C5*D5*F5+G5)*0.024*(V$20-V$21)*V$22","v":539.78942160000008},{"$f":"(C5*D5*F5+G5)*0.024*(W$20-W$21)*W$22","v":690.40199447999998}]
[null,{"$f":"Transmission!A10","v":"Haustür"},{"$f":"Transmission!B10","v":3.8},1.8,"-",{"$f":"Transmission!F10","v":1},{"$f":"$C$20*C6","v":0.19},{"$f":"C6*D6*F6+G6","v":7.03},{"$f":"SUM(L6:W6)","v":616.63785600000006},null,null,{"$f":"(C6*D6*F6+G6)*0.024*(L$20-L$21)*L$22","v":106.17549600000001},{"$f":"(C6*D6*F6+G6)*0.024*(M$20-M$21)*M$22","v":86.924543999999997},{"$f":"(C6*D6*F6+G6)*0.024*(N$20-N$21)*N$22","v":77.931768000000005},{"$f":"(C6*D6*F6+G6)*0.024*(O$20-O$21)*O$22","v":48.0852},{"$f":"(C6*D6*F6+G6)*0.024*(P$20-P$21)*P$22","v":31.904951999999998},{"$f":"(C6*D6*F6+G6)*0.024*(Q$20-Q$21)*Q$22","v":16.703280000000007},{"$f":"(C6*D6*F6+G6)*0.024*(R$20-R$21)*R$22","v":5.2303199999999999},{"$f":"(C6*D6*F6+G6)*0.024*(S$20-S$21)*S$22","v":3.6612239999999967},{"$f":"(C6*D6*F6+G6)*0.024*(T$20-T$21)*T$22","v":23.283360000000002},{"$f":"(C6*D6*F6+G6)*0.024*(U$20-U$21)*U$22","v":51.78016800000001},{"$f":"(C6*D6*F6+G6)*0.024*(V$20-V$21)*V$22","v":72.380880000000019},{"$f":"(C6*D6*F6+G6)*0.024*(W$20-W$21)*W$22","v":92.576663999999994}]
[null,{"$f":"Transmission!A11","v":"Kellerdecke/Sohle"},{"$f":"Transmission!B11","v":87.24},0.35,"-",0.45,{"$f":"$C$20*C7","v":4.3620000000000001},18.1023,1587.8468649599999,null,null,273.40265736000003,223.83131903999998,200.67485687999999,123.819732,82.155478319999986,43.011064800000007,13.468111199999999,9.4276778399999888,59.954817599999991,133.33430088,186.38128079999998,238.38556824]
[null,{"$f":"Transmission!A12","v":"Dach"},{"$f":"Transmission!B12","v":50},0.2,"-",{"$f":"Transmission!F12","v":1},2.5,12.5,1096.44,null,null,188.79,154.56,138.57,85.5,56.73,29.700000000000006,9.2999999999999989,6.5099999999999927,41.4,92.070000000000007,128.69999999999999,164.60999999999999]
[null,{"$f":"Transmission!A13","v":"OG-Decke"},{"$f":"Transmission!B13","v":63.91},0.2,"-",{"$f":"Transmission!F13","v":0.8},3.1955,13.421099999999999,1177.2344707199998,null,null,202.70155751999999,165.94921727999997,148.78094615999998,91.800323999999989,60.91032023999999,31.888533600000002,9.9852983999999996,6.9897088799999922,44.450683199999993,98.854454159999989,138.18364559999998,176.73978167999996]
[null,{"$f":"Transmission!A14","v":"Bodenluke"},{"$f":"Transmission!B14","v":0.72},0.2,"-",{"$f":"Transmission!F14","v":0.8},3.5999999999999997E-2,0.1512,13.262538239999998,null,null,2.2836038400000001,1.86955776,1.6761427200000001,1.034208,0.68620608000000005,0.3592512000000001,0.1124928,7.8744959999999919E-2,0.50077439999999995,1.1136787200000002,1.5567552,1.99112256]
[{"$f":"$C$5*C11/$C$15","v":28.334492989892404},{"$f":"Transmission!A15","v":"Fenster nord"},{"$f":"Transmission!B15","v":5.47},1.3,0.6,{"$f":"Transmission!F15","v":1},0.27350000000000002,7.3845000000000001,647.73289439999996,null,null,111.52958040000001,91.307865599999985,81.861613199999994,50.509979999999999,33.513814799999999,17.545572000000003,5.4940679999999995,3.8458475999999959,24.457463999999998,54.391273200000001,76.030812000000012,97.24500359999999]
[{"$f":"$C$5*C12/$C$15","v":25.278304532116074},{"$f":"Transmission!A16","v":"Fenster ost"},{"$f":"Transmission!B16","v":4.88},1.3,0.6,{"$f":"Transmission!F16","v":1},0.24399999999999999,6.5880000000000001,577.86773760000005,null,null,99.499881600000009,81.459302399999999,73.031932800000007,45.061920000000001,29.898979199999999,15.653088000000006,4.9014720000000001,3.4310303999999965,21.819455999999999,48.524572800000008,67.830048000000005,86.756054399999996]
[{"$f":"$C$5*C13/$C$15","v":38.539054450603196},{"$f":"Transmission!A17","v":"Fenster west"},{"$f":"Transmission!B17","v":7.44},1.3,0.6,{"$f":"Transmission!F17","v":1},0.37200000000000005,10.044,881.01146880000022,null,null,151.69654080000004,124.19205120000001,111.34376640000001,68.700960000000009,45.5836896,23.864544000000006,7.4727360000000003,5.2309151999999948,33.265728000000003,73.980086400000005,103.41302400000001,132.26742720000001]
[{"$f":"$C$5*C14/$C$15","v":66.718148027388324},{"$f":"Transmission!A18","v":"Fenster süd"},{"$f":"Transmission!B18","v":12.88},1.3,0.6,{"$f":"Transmission!F18","v":1},0.64400000000000013,17.388000000000005,1525.1918976000006,null,null,{"$f":"(C14*D14*F14+G14)*0.024*(L$20-L$21)*L$22","v":262.61444160000008},214.99914240000007,192.75641280000008,118.93392000000004,78.913699200000025,41.31388800000002,12.936672000000003,9.0556703999999932,57.589056000000014,128.07305280000006,179.02684800000009,228.97909440000004]
[null,null,{"$f":"SUM(C11:C14)","v":30.67}]
{"$rows_left_out":184}